Target
Genome polyprotein
Ligand
BDBM50120286
Substrate
Meas. Tech.
ChEBML_143490
Ki
7±n/a nM
Citation
 Priestley, ESDe Lucca, IGhavimi, BErickson-Viitanen, SDecicco, CP P1 Phenethyl peptide boronic acid inhibitors of HCV NS3 protease. Bioorg Med Chem Lett 12:3199-202 (2002)  
Target
Name:
Genome polyprotein
Synonyms:
Hepatitis C virus NS3 protease/helicase | Hepatitis C virus serine protease, NS3/NS4A
Type:
Protein
Mol. Mass.:
67067.41
Organism:
Hepatitis C virus
Description:
A3EZI9
Residue:
631
  
Inhibitor
Name:
BDBM50120286
Synonyms:
CHEMBL322933 | Peptide Boronic Acid analogue
Type:
Small organic molecule
Emp. Form.:
C41H69BN6O11
Mol. Mass.:
832.831
SMILES:
CC(C)CCC[C@H](NC(=O)[C@H]1CCCN1C(=O)[C@@H](NC(=O)[C@@H](NC(=O)[C@H](CCC(O)=O)NC(=O)[C@@H](N)CC(O)=O)C(C)C)C(C)C)B1O[C@@H]2C[C@@H]3C[C@@H](C3(C)C)[C@]2(C)O1
: