Target
Genome polyprotein
Ligand
BDBM50120304
Substrate
Meas. Tech.
ChEBML_143490
Ki
4±n/a nM
Citation
 Priestley, ESDe Lucca, IGhavimi, BErickson-Viitanen, SDecicco, CP P1 Phenethyl peptide boronic acid inhibitors of HCV NS3 protease. Bioorg Med Chem Lett 12:3199-202 (2002)  
Target
Name:
Genome polyprotein
Synonyms:
Hepatitis C virus NS3 protease/helicase | Hepatitis C virus serine protease, NS3/NS4A
Type:
Protein
Mol. Mass.:
67067.41
Organism:
Hepatitis C virus
Description:
A3EZI9
Residue:
631
  
Inhibitor
Name:
BDBM50120304
Synonyms:
CHEMBL108815 | Peptide Boronic Acid analogue
Type:
Small organic molecule
Emp. Form.:
C43H64BBrN6O11
Mol. Mass.:
931.717
SMILES:
CC(C)[C@H](NC(=O)[C@H](CCC(O)=O)NC(=O)[C@@H](N)CC(O)=O)C(=O)N[C@@H](C(C)C)C(=O)N1CCC[C@@H]1C(=O)N[C@@H](CCc1ccc(Br)cc1)B1O[C@@H]2C[C@@H]3C[C@@H](C3(C)C)[C@]2(C)O1
: