Target
Inosine-5'-monophosphate dehydrogenase 2
Ligand
BDBM50120525
Substrate
Meas. Tech.
ChEBML_89933
IC50
35±n/a nM
Citation
 Dhar, TGShen, ZFleener, CARouleau, KABarrish, JCHollenbaugh, DLIwanowicz, EJ The TosMIC approach to 3-(oxazol-5-yl) indoles: application to the synthesis of indole-based IMPDH inhibitors. Bioorg Med Chem Lett 12:3305-8 (2002)  
Target
Name:
Inosine-5'-monophosphate dehydrogenase 2
Synonyms:
IMDH2_HUMAN IMPD 2 IMPDH-II Inosine 5'-monophosphate dehydrogenase II (IMPDH II) Inosine-5 -monophosphate dehydrogenase 2 | Inosine-5'-monophosphate dehydrogenase (IMPDH)
Type:
Enzyme
Mol. Mass.:
55806.87
Organism:
Homo sapiens (Human)
Description:
Recombinant IMPDH2 expressed in E. coli.
Residue:
514
  
Inhibitor
Name:
BDBM50120525
Synonyms:
1-(3-Oxazol-5-yl-1H-indol-6-yl)-3-o-tolyl-urea | CHEMBL116061
Type:
Small organic molecule
Emp. Form.:
C19H16N4O2
Mol. Mass.:
332.3559
SMILES:
Cc1ccccc1NC(=O)Nc1ccc2c(c[nH]c2c1)-c1cnco1
: