Target
Poly [ADP-ribose] polymerase 1
Ligand
BDBM50120717
Substrate
Meas. Tech.
ChEMBL_159659 (CHEMBL761787)
Ki
38±n/a nM
Citation
 Canan Koch, SSThoresen, LHTikhe, JGMaegley, KAAlmassy, RJLi, JYu, XHZook, SEKumpf, RAZhang, CBoritzki, TJMansour, RNZhang, KEEkker, ACalabrese, CRCurtin, NJKyle, SThomas, HDWang, LZCalvert, AHGolding, BTGriffin, RJNewell, DRWebber, SEHostomsky, Z Novel tricyclic poly(ADP-ribose) polymerase-1 inhibitors with potent anticancer chemopotentiating activity: design, synthesis, and X-ray cocrystal structure. J Med Chem 45:4961-74 (2002)  
Target
Name:
Poly [ADP-ribose] polymerase 1
Synonyms:
(ARTD1 or PARP1) 2.4.2.30 ADPRT ARTD1 Human diphtheria toxin-like ADP-ribosyltransferase (ARTD1 or PARP1) NT-PARP-1 PARP1 PPOL Poly [ADP-ribose] polymerase 1 (PARP) Poly [ADP-ribose] polymerase 1 (PARP1) Poly [ADP-ribose] polymerase 1, 28-kDa form Poly [ADP-ribose] polymerase 1, processed C-terminus Poly [ADP-ribose] polymerase-1 Poly(ADP-ribose) polymerase-1 (ARTD1/PARP1) Protein poly-ADP-ribosyltransferase PARP1 | Synonyms=ADPRT
Type:
Mol. Mass.:
113114.22
Organism:
Homo sapiens (Human)
Description:
P09874
Residue:
1014
  
Inhibitor
Name:
BDBM50120717
Synonyms:
1,3,4,5-Tetrahydro-azepino[5,4,3-cd]indol-6-one | CHEMBL343641
Type:
Small organic molecule
Emp. Form.:
C11H10N2O
Mol. Mass.:
186.2099
SMILES:
O=C1NCCc2c[nH]c3cccc1c23
: