Target
Gamma-aminobutyric acid receptor subunit alpha-5
Ligand
BDBM50001728
Substrate
Meas. Tech.
ChEMBL_68414 (CHEMBL680330)
EC50
10±n/a nM
Citation
 Albaugh, PAMarshall, LGregory, JWhite, GHutchison, ARoss, PCGallagher, DWTallman, JFCrago, MCassella, JV Synthesis and biological evaluation of 7,8,9,10-tetrahydroimidazo[1,2-c]pyrido[3,4-e]pyrimdin-5(6H)-ones as functionally selective ligands of the benzodiazepine receptor site on the GABA(A) receptor. J Med Chem 45:5043-51 (2002)  
Target
Name:
Gamma-aminobutyric acid receptor subunit alpha-5
Synonyms:
GABA receptor alpha-5 subunit GABRA5 Gamma-aminobutyric acid receptor subunit alpha-5 (GABA(A)) | Gamma-aminobutyric acid receptor subunit alpha-5 (GABAA)
Type:
Enzyme
Mol. Mass.:
52160.59
Organism:
Homo sapiens (Human)
Description:
P31644
Residue:
462
  
Inhibitor
Name:
BDBM50001728
Synonyms:
8-Chloro-1-methyl-6-phenyl-4H-s-triazolo(4,3-a)(1,4)benzodiazepine ALPRAZOLAM Xanax
Type:
Small organic molecule
Emp. Form.:
C17H13ClN4
Mol. Mass.:
308.765
SMILES:
Cc1nnc2CN=C(c3ccccc3)c3cc(Cl)ccc3-n12
: