Target
Stromelysin-1
Ligand
BDBM50121953
Substrate
Meas. Tech.
ChEMBL_205633 (CHEMBL813241)
Kd
3000000±n/a nM
Citation
 Hajduk, PJShuker, SBNettesheim, DGCraig, RAugeri, DJBetebenner, DAlbert, DHGuo, YMeadows, RPXu, LMichaelides, MDavidsen, SKFesik, SW NMR-based modification of matrix metalloproteinase inhibitors with improved bioavailability. J Med Chem 45:5628-39 (2002)  
Target
Name:
Stromelysin-1
Synonyms:
MMP-3 MMP3_HUMAN Matrix metalloproteinase 3 Matrix metalloproteinase-3 (MMP-3) SL-1 Stromelysin 1 | Transin-1
Type:
Enzyme
Mol. Mass.:
53973.13
Organism:
Homo sapiens (Human)
Description:
P08254
Residue:
477
  
Inhibitor
Name:
BDBM50121953
Synonyms:
2-mercaptoethanecarboxylic acid 3-mercaptopropionic acid 3-thiohydracrylic acid 3-thiopropanoic acid 3MPA beta-mercaptopropionic acid | beta-thiopropionic acid
Type:
Small organic molecule
Emp. Form.:
C3H6O2S
Mol. Mass.:
106.144
SMILES:
OC(=O)CCS
: