Target
Integrin alpha-V/beta-3
Ligand
BDBM50092512
Substrate
Meas. Tech.
ChEMBL_214640 (CHEMBL819720)
IC50
0.07±n/a nM
Citation
 Feuston, BPCulberson, JCDuggan, MEHartman, GDLeu, CTRodan, SB Binding model for nonpeptide antagonists of alpha(v)beta(3) integrin. J Med Chem 45:5640-8 (2002)  
Target
Name:
Integrin alpha-V/beta-3
Synonyms:
ITGAV/ITGB3 | Integrin beta-3/Vitronectin receptor alpha
Type:
Enzyme
Mol. Mass.:
Description:
Components:
This complex has 2 components.
Component 1
Name:
Integrin alpha-V
Synonyms:
ITAV_HUMAN Integrin alpha-V/alpha-5 VNRA Vitronectin receptor | Vitronectin receptor subunit alpha
Type:
PROTEIN
Mol. Mass.:
116024.92
Organism:
Homo sapiens (Human)
Description:
ChEMBL_582336
Residue:
1048
  
Component 2
Name:
Integrin beta-3
Synonyms:
CD_antigen=CD61 GPIIIa ITGB3 Platelet membrane glycoprotein IIIa
Type:
Protein
Mol. Mass.:
87038.91
Organism:
Homo sapiens (Human)
Description:
P05106
Residue:
788
  
Inhibitor
Name:
BDBM50092512
Synonyms:
2-Benzenesulfonylamino-3-{4-[2-(5,6,7,8-tetrahydro-[1,8]naphthyridin-2-yl)-ethyl]-benzoylamino}-propionic acid | CHEMBL123262
Type:
Small organic molecule
Emp. Form.:
C26H28N4O5S
Mol. Mass.:
508.589
SMILES:
OC(=O)[C@H](CNC(=O)c1ccc(CCc2ccc3CCCNc3n2)cc1)NS(=O)(=O)c1ccccc1
: