Target
Glutamate receptor ionotropic, NMDA 1
Ligand
BDBM50122595
Substrate
Meas. Tech.
ChEMBL_141417 (CHEMBL752321)
Ki
580±n/a nM
Citation
 Jansen, MPotschka, HBrandt, CLöscher, WDannhardt, G Hydantoin-substituted 4,6-dichloroindole-2-carboxylic acids as ligands with high affinity for the glycine binding site of the NMDA receptor. J Med Chem 46:64-73 (2002)  
Target
Name:
Glutamate receptor ionotropic, NMDA 1
Synonyms:
GRIN1 Glutamate [NMDA] receptor subunit zeta-1 N-methyl-D-aspartate receptor subunit NR1 NMDZ1_HUMAN | phencyclidine
Type:
Enzyme Catalytic Domain
Mol. Mass.:
105397.81
Organism:
Homo sapiens (Human)
Description:
Q05586
Residue:
938
  
Inhibitor
Name:
BDBM50122595
Synonyms:
4,6-Dichloro-3-(4-oxo-3-phenyl-2-thioxo-imidazolidin-1-ylmethyl)-1H-indole-2-carboxylic acid | CHEMBL163541
Type:
Small organic molecule
Emp. Form.:
C19H13Cl2N3O3S
Mol. Mass.:
434.296
SMILES:
OC(=O)c1[nH]c2cc(Cl)cc(Cl)c2c1Cn1cc(O)n(-c2ccccc2)c1=S
: