Target
Glutamate receptor ionotropic, NMDA 1
Ligand
BDBM50004960
Substrate
Meas. Tech.
ChEMBL_141417 (CHEMBL752321)
Ki
2900±n/a nM
Citation
 Jansen, MPotschka, HBrandt, CLöscher, WDannhardt, G Hydantoin-substituted 4,6-dichloroindole-2-carboxylic acids as ligands with high affinity for the glycine binding site of the NMDA receptor. J Med Chem 46:64-73 (2002)  
Target
Name:
Glutamate receptor ionotropic, NMDA 1
Synonyms:
GRIN1 Glutamate [NMDA] receptor subunit zeta-1 N-methyl-D-aspartate receptor subunit NR1 NMDZ1_HUMAN | phencyclidine
Type:
Enzyme Catalytic Domain
Mol. Mass.:
105397.81
Organism:
Homo sapiens (Human)
Description:
Q05586
Residue:
938
  
Inhibitor
Name:
BDBM50004960
Synonyms:
4,6-Dichloro-1H-indole-2-carboxylic acid | CHEMBL301556
Type:
Small organic molecule
Emp. Form.:
C9H5Cl2NO2
Mol. Mass.:
230.047
SMILES:
OC(=O)c1cc2c(Cl)cc(Cl)cc2[nH]1
: