Target
Amine oxidase [flavin-containing] A
Ligand
BDBM50084137
Substrate
Meas. Tech.
ChEMBL_122776 (CHEMBL730885)
IC50
8000±n/a nM
Citation
 Cosford, NDTehrani, LRoppe, JSchweiger, ESmith, NDAnderson, JBristow, LBrodkin, JJiang, XMcDonald, IRao, SWashburn, MVarney, MA 3-[(2-Methyl-1,3-thiazol-4-yl)ethynyl]-pyridine: a potent and highly selective metabotropic glutamate subtype 5 receptor antagonist with anxiolytic activity. J Med Chem 46:204-6 (2003)  
Target
Name:
Amine oxidase [flavin-containing] A
Synonyms:
AOFA_MOUSE MAO-A Monoamine oxidase Monoamine oxidase type A
Type:
PROTEIN
Mol. Mass.:
59608.24
Organism:
Mus musculus
Description:
ChEMBL_122776
Residue:
526
  
Inhibitor
Name:
BDBM50084137
Synonyms:
2-Methyl-6-(phenylethynyl)pyridine 2-Methyl-6-phenylethynyl-pyridine(MPEP) 2-methyl-6-(phenyl-ethynyl)pyridine 6-methyl-2-(2-phenylethynyl)pyridine CHEMBL66654 US10618900, No. MPEP | [3H]-2-methyl-6-(phenylethynyl)-pyridine
Type:
Small organic molecule
Emp. Form.:
C14H11N
Mol. Mass.:
193.2438
SMILES:
Cc1cccc(n1)C#Cc1ccccc1
: