Target
Cytochrome P450 2C19
Ligand
BDBM21690
Substrate
Meas. Tech.
ChEMBL_2073861 (CHEMBL4729395)
IC50
>50000±n/a nM
Citation
 Kirk, RBetson, MBingham, MDoyle, PHarvey, RHuxley, AMoat, JPesnot, TTait, MHallworth, SNelson, G Novel C-7 carbon substituted fourth generation fluoroquinolones targeting N. Gonorrhoeae infections. Bioorg Med Chem Lett 30:0 (2020)  
Target
Name:
Cytochrome P450 2C19
Synonyms:
CP2CJ_HUMAN CYPIIC17 Cytochrome P450 2C19 (CYP2C19) Mephenytoin 4-hydroxylase P450-254C
Type:
Enzyme
Mol. Mass.:
55935.47
Organism:
Homo sapiens (Human)
Description:
P33261
Residue:
490
  
Inhibitor
Name:
BDBM21690
Synonyms:
1-cyclopropyl-6-fluoro-4-oxo-7-(piperazin-1-yl)-1,4-dihydroquinoline-3-carboxylic acid Bay 09867 Ciprinol Ciprofloxacin US9138393, Ciprofloxacin HCl | US9144538, Ciprofloxacin HCl
Type:
Small organic molecule
Emp. Form.:
C17H18FN3O3
Mol. Mass.:
331.3415
SMILES:
OC(=O)c1cn(C2CC2)c2cc(N3CCNCC3)c(F)cc2c1=O
: