Target
Integrin alpha-V/beta-3
Ligand
BDBM50123247
Substrate
Meas. Tech.
ChEMBL_217945 (CHEMBL823913)
IC50
0.000920±n/a nM
Citation
 Bubenik, MMeerovitch, KBergeron, FAttardo, GChan, L Thiophene-based vitronectin receptor antagonists. Bioorg Med Chem Lett 13:503-6 (2003)  
Target
Name:
Integrin alpha-V/beta-3
Synonyms:
ITGAV/ITGB3 | Integrin beta-3/Vitronectin receptor alpha
Type:
Enzyme
Mol. Mass.:
Description:
Components:
This complex has 2 components.
Component 1
Name:
Integrin alpha-V
Synonyms:
ITAV_HUMAN Integrin alpha-V/alpha-5 VNRA Vitronectin receptor | Vitronectin receptor subunit alpha
Type:
PROTEIN
Mol. Mass.:
116024.92
Organism:
Homo sapiens (Human)
Description:
ChEMBL_582336
Residue:
1048
  
Component 2
Name:
Integrin beta-3
Synonyms:
CD_antigen=CD61 GPIIIa ITGB3 Platelet membrane glycoprotein IIIa
Type:
Protein
Mol. Mass.:
87038.91
Organism:
Homo sapiens (Human)
Description:
P05106
Residue:
788
  
Inhibitor
Name:
BDBM50123247
Synonyms:
(S)-3-{[5-(3-Guanidino-phenyl)-thiophene-2-carbonyl]-amino}-2-(2,4,6-trimethyl-benzenesulfonylamino)-propionic acid; TFA | CHEMBL146264
Type:
Small organic molecule
Emp. Form.:
C24H27N5O5S2
Mol. Mass.:
529.632
SMILES:
[#6]-c1cc(-[#6])c(c(-[#6])c1)S(=O)(=O)[#7]-[#6@@H](-[#6]-[#7]-[#6](=O)-c1ccc(s1)-c1cccc(c1)\[#7]=[#6](\[#7])-[#7])-[#6](-[#8])=O
: