Target
2-hydroxyacylsphingosine 1-beta-galactosyltransferase
Ligand
BDBM50561672
Substrate
Meas. Tech.
ChEMBL_2075685 (CHEMBL4731219)
IC50
1.7±n/a nM
Citation
 Thurairatnam, SLim, SBarker, RHChoi-Sledeski, YMHirth, BHJiang, JMacor, JEMakino, EManiar, SMusick, KPribish, JRMunson, M Brain Penetrable Inhibitors of Ceramide Galactosyltransferase for the Treatment of Lysosomal Storage Disorders. ACS Med Chem Lett 11:2010-2016 (2020)  
Target
Name:
2-hydroxyacylsphingosine 1-beta-galactosyltransferase
Synonyms:
2-hydroxyacylsphingosine 1-beta-galactosyltransferase CGT Ceramide UDP-galactosyltransferase UDP-galactose-ceramide galactosyltransferase UGT8
Type:
PROTEIN
Mol. Mass.:
61470.74
Organism:
Homo sapiens
Description:
ChEMBL_120191
Residue:
541
  
Inhibitor
Name:
BDBM50561672
Synonyms:
CHEMBL4750432
Type:
Small organic molecule
Emp. Form.:
C20H20F6N4O4S
Mol. Mass.:
526.453
SMILES:
CNC(=O)c1csc2c(cc(nc12)N1CCC(CC1)OC(=O)N1CC(C1)OC(F)(F)F)C(F)(F)F
: