Target
2-hydroxyacylsphingosine 1-beta-galactosyltransferase
Ligand
BDBM50561673
Substrate
Meas. Tech.
ChEMBL_2075685 (CHEMBL4731219)
IC50
510±n/a nM
Citation
 Thurairatnam, SLim, SBarker, RHChoi-Sledeski, YMHirth, BHJiang, JMacor, JEMakino, EManiar, SMusick, KPribish, JRMunson, M Brain Penetrable Inhibitors of Ceramide Galactosyltransferase for the Treatment of Lysosomal Storage Disorders. ACS Med Chem Lett 11:2010-2016 (2020)  
Target
Name:
2-hydroxyacylsphingosine 1-beta-galactosyltransferase
Synonyms:
2-hydroxyacylsphingosine 1-beta-galactosyltransferase CGT Ceramide UDP-galactosyltransferase UDP-galactose-ceramide galactosyltransferase UGT8
Type:
PROTEIN
Mol. Mass.:
61470.74
Organism:
Homo sapiens
Description:
ChEMBL_120191
Residue:
541
  
Inhibitor
Name:
BDBM50561673
Synonyms:
CHEMBL4799203
Type:
Small organic molecule
Emp. Form.:
C22H28F3N5O3S
Mol. Mass.:
499.55
SMILES:
CNC(=O)c1csc2c(cc(nc12)N1CCC(CC1)OC(=O)NCCN1CCCC1)C(F)(F)F
: