Target
2-hydroxyacylsphingosine 1-beta-galactosyltransferase
Ligand
BDBM50561654
Substrate
Meas. Tech.
ChEMBL_2075686 (CHEMBL4731220)
IC50
0.200000±n/a nM
Citation
 Thurairatnam, SLim, SBarker, RHChoi-Sledeski, YMHirth, BHJiang, JMacor, JEMakino, EManiar, SMusick, KPribish, JRMunson, M Brain Penetrable Inhibitors of Ceramide Galactosyltransferase for the Treatment of Lysosomal Storage Disorders. ACS Med Chem Lett 11:2010-2016 (2020)  
Target
Name:
2-hydroxyacylsphingosine 1-beta-galactosyltransferase
Synonyms:
2-hydroxyacylsphingosine 1-beta-galactosyltransferase CGT Ceramide UDP-galactosyltransferase UDP-galactose-ceramide galactosyltransferase UGT8
Type:
PROTEIN
Mol. Mass.:
61470.74
Organism:
Homo sapiens
Description:
ChEMBL_120191
Residue:
541
  
Inhibitor
Name:
BDBM50561654
Synonyms:
CHEMBL4785914
Type:
Small organic molecule
Emp. Form.:
C20H22F6N4O4S
Mol. Mass.:
528.468
SMILES:
CNC(=O)c1csc2c(cc(nc12)N1CCC(CC1)OC(=O)N[C@@H](C)COC(F)(F)F)C(F)(F)F
: