Target
Sodium-dependent noradrenaline transporter
Ligand
BDBM50006774
Substrate
Meas. Tech.
ChEMBL_144972 (CHEMBL753705)
Ki
1.4±n/a nM
Citation
 Goodman, MMChen, PPlisson, CMartarello, LGalt, JVotaw, JRKilts, CDMalveaux, GCamp, VMShi, BEly, TDHowell, LMcConathy, JNemeroff, CB Synthesis and characterization of iodine-123 labeled 2beta-carbomethoxy-3beta-(4'-((Z)-2-iodoethenyl)phenyl)nortropane. A ligand for in vivo imaging of serotonin transporters by single-photon-emission tomography. J Med Chem 46:925-35 (2003)  
Target
Name:
Sodium-dependent noradrenaline transporter
Synonyms:
Monoamine transporter NET Noradrenaline Transporter (NET) Norepinephrine transporter protein (NET) SLC6A2 Sodium-dependent noradrenaline transporter (NET) | Solute carrier family 6 member 2
Type:
Multi-pass membrane protein
Mol. Mass.:
69337.72
Organism:
Homo sapiens (Human)
Description:
P23975
Residue:
617
  
Inhibitor
Name:
BDBM50006774
Synonyms:
(2S,3S)-methyl 3-(4-iodophenyl)-8-methyl-8-aza-bicyclo[3.2.1]octane-2-carboxylate CHEMBL311347 | methyl 3-(4-iodophenyl)-8-methyl-(2S,3S)-8-azabicyclo[3.2.1]octane-2-carboxylate
Type:
Small organic molecule
Emp. Form.:
C16H20INO2
Mol. Mass.:
385.24
SMILES:
COC(=O)[C@@H]1C2CC[C@H](C[C@@H]1c1ccc(I)cc1)N2C
: