Target
Bifunctional epoxide hydrolase 2
Ligand
BDBM25729
Substrate
Meas. Tech.
ChEMBL_202752 (CHEMBL809079)
IC50
2.57E2±n/a nM
Citation
 McElroy, NRJurs, PCMorisseau, CHammock, BD QSAR and classification of murine and human soluble epoxide hydrolase inhibition by urea-like compounds. J Med Chem 46:1066-80 (2003)  
Target
Name:
Bifunctional epoxide hydrolase 2
Synonyms:
Cytosolic epoxide hydrolase 2 EPHX2 HYES_HUMAN Soluble epoxide hydrolase (sEH) | epoxide hydrolase 2, cytoplasmic
Type:
Enzyme
Mol. Mass.:
62613.07
Organism:
Homo sapiens (Human)
Description:
P34913
Residue:
555
  
Inhibitor
Name:
BDBM25729
Synonyms:
1,3-bis(3,4-dichlorophenyl)urea US8815951, 299 | Urea-based compound, 10
Type:
Small organic molecule
Emp. Form.:
C13H8Cl4N2O
Mol. Mass.:
350.027
SMILES:
Clc1ccc(NC(=O)Nc2ccc(Cl)c(Cl)c2)cc1Cl
: