Target
Prostaglandin G/H synthase 2
Ligand
BDBM50124788
Substrate
Meas. Tech.
ChEBML_159600
IC50
2630±n/a nM
Citation
 Paramashivappa, RPhani Kumar, PSubba Rao, PVSrinivasa Rao, A Design, synthesis and biological evaluation of benzimidazole/benzothiazole and benzoxazole derivatives as cyclooxygenase inhibitors. Bioorg Med Chem Lett 13:657-60 (2003)  
Target
Name:
Prostaglandin G/H synthase 2
Synonyms:
COX2 Cyclooxygenase 2 (COX-2) Cyclooxygenase-2 (COX-2 AA) Cyclooxygenase-2 (COX-2) PGH2_HUMAN PHS II Prostaglandin E synthase/G/H synthase 2 Prostaglandin-endoperoxide synthase 2
Type:
Enzyme
Mol. Mass.:
69003.89
Organism:
Homo sapiens (Human)
Description:
Recombinant Cox-2 provided by Cayman (Cayman Chemical Co.,Ann Arbor, MI).
Residue:
604
  
Inhibitor
Name:
BDBM50124788
Synonyms:
2-(2-Methoxy-6-pentadecyl-benzylsulfanyl)-5-methyl-1H-benzoimidazole | CHEMBL161788
Type:
Small organic molecule
Emp. Form.:
C31H46N2OS
Mol. Mass.:
494.775
SMILES:
CCCCCCCCCCCCCCCc1cccc(OC)c1CSc1nc2ccc(C)cc2[nH]1
: