Target
Coagulation factor X
Ligand
BDBM50124972
Substrate
Meas. Tech.
ChEMBL_48972 (CHEMBL663502)
IC50
8±n/a nM
Citation
 Huang, WNaughton, MAYang, HSu, TDam, SWong, PWArfsten, AEdwards, SSinha, UHollenbach, SScarborough, RMZhu, BY Design, synthesis, and structure-activity relationships of unsubstituted piperazinone-based transition state factor Xa inhibitors. Bioorg Med Chem Lett 13:723-8 (2003)  
Target
Name:
Coagulation factor X
Synonyms:
Activated coagulation factor X (FXa) Coagulation factor X precursor F10 Factor X heavy chain Factor Xa Stuart-Prower factor
Type:
Enzyme
Mol. Mass.:
54726.60
Organism:
Homo sapiens (Human)
Description:
Residue:
488
  
Inhibitor
Name:
BDBM50124972
Synonyms:
CHEMBL163174 | N-[4-Guanidino-1-(thiazole-2-carbonyl)-butyl]-2-[4-(naphthalene-2-sulfonyl)-2-oxo-piperazin-1-yl]-acetamide
Type:
Small organic molecule
Emp. Form.:
C25H29N7O5S2
Mol. Mass.:
571.672
SMILES:
NC(=N)NCCCC(NC(=O)CN1CCN(CC1=O)S(=O)(=O)c1ccc2ccccc2c1)C(=O)c1nccs1
: