Target
Coagulation factor X
Ligand
BDBM50124977
Substrate
Meas. Tech.
ChEBML_49131
IC50
17±n/a nM
Citation
 Huang, WNaughton, MAYang, HSu, TDam, SWong, PWArfsten, AEdwards, SSinha, UHollenbach, SScarborough, RMZhu, BY Design, synthesis, and structure-activity relationships of unsubstituted piperazinone-based transition state factor Xa inhibitors. Bioorg Med Chem Lett 13:723-8 (2003)  
Target
Name:
Coagulation factor X
Synonyms:
Activated coagulation factor X (FXa) Coagulation factor X precursor F10 Factor X heavy chain Factor Xa Stuart-Prower factor
Type:
Enzyme
Mol. Mass.:
54726.60
Organism:
Homo sapiens (Human)
Description:
Residue:
488
  
Inhibitor
Name:
BDBM50124977
Synonyms:
2-{4-[2-(4-Chloro-phenyl)-acetyl]-2-oxo-piperazin-1-yl}-N-[(R)-4-guanidino-1-(thiazole-2-carbonyl)-butyl]-acetamide | CHEMBL162909
Type:
Small organic molecule
Emp. Form.:
C23H28ClN7O4S
Mol. Mass.:
534.031
SMILES:
NC(=N)NCCC[C@@H](NC(=O)CN1CCN(CC1=O)C(=O)Cc1ccc(Cl)cc1)C(=O)c1nccs1
: