Target
Coagulation factor X
Ligand
BDBM50125006
Substrate
Meas. Tech.
ChEBML_49131
IC50
38±n/a nM
Citation
 Huang, WNaughton, MAYang, HSu, TDam, SWong, PWArfsten, AEdwards, SSinha, UHollenbach, SScarborough, RMZhu, BY Design, synthesis, and structure-activity relationships of unsubstituted piperazinone-based transition state factor Xa inhibitors. Bioorg Med Chem Lett 13:723-8 (2003)  
Target
Name:
Coagulation factor X
Synonyms:
Activated coagulation factor X (FXa) Coagulation factor X precursor F10 Factor X heavy chain Factor Xa Stuart-Prower factor
Type:
Enzyme
Mol. Mass.:
54726.60
Organism:
Homo sapiens (Human)
Description:
Residue:
488
  
Inhibitor
Name:
BDBM50125006
Synonyms:
2-{4-[4-(3-Chloro-2-cyano-phenoxy)-benzenesulfonyl]-2-oxo-piperazin-1-yl}-N-[4-guanidino-1-(thiazole-2-carbonyl)-butyl]-acetamide | CHEMBL351180
Type:
Small organic molecule
Emp. Form.:
C28H29ClN8O6S2
Mol. Mass.:
673.163
SMILES:
NC(=N)NCCCC(NC(=O)CN1CCN(CC1=O)S(=O)(=O)c1ccc(Oc2cccc(Cl)c2C#N)cc1)C(=O)c1nccs1
: