Target
Tissue-type plasminogen activator
Ligand
BDBM50124992
Substrate
Meas. Tech.
ChEBML_208072
IC50
4010±n/a nM
Citation
 Huang, WNaughton, MAYang, HSu, TDam, SWong, PWArfsten, AEdwards, SSinha, UHollenbach, SScarborough, RMZhu, BY Design, synthesis, and structure-activity relationships of unsubstituted piperazinone-based transition state factor Xa inhibitors. Bioorg Med Chem Lett 13:723-8 (2003)  
Target
Name:
Tissue-type plasminogen activator
Synonyms:
Alteplase Reteplase Thrombin receptor protein Tissue-type plasminogen activator (tPA) t-PA t-plasminogen activator
Type:
Enzyme
Mol. Mass.:
62931.08
Organism:
Homo sapiens (Human)
Description:
Residue:
562
  
Inhibitor
Name:
BDBM50124992
Synonyms:
CHEMBL162461 | N-[(R)-4-Guanidino-1-(thiazole-2-carbonyl)-butyl]-2-(2-oxo-4-phenylmethanesulfonyl-piperazin-1-yl)-acetamide
Type:
Small organic molecule
Emp. Form.:
C22H29N7O5S2
Mol. Mass.:
535.64
SMILES:
NC(=N)NCCC[C@@H](NC(=O)CN1CCN(CC1=O)S(=O)(=O)Cc1ccccc1)C(=O)c1nccs1
: