Target
Serine protease 1
Ligand
BDBM50124990
Substrate
Meas. Tech.
ChEBML_213041
IC50
2±n/a nM
Citation
 Huang, WNaughton, MAYang, HSu, TDam, SWong, PWArfsten, AEdwards, SSinha, UHollenbach, SScarborough, RMZhu, BY Design, synthesis, and structure-activity relationships of unsubstituted piperazinone-based transition state factor Xa inhibitors. Bioorg Med Chem Lett 13:723-8 (2003)  
Target
Name:
Serine protease 1
Synonyms:
Alpha-trypsin chain 1 Beta-trypsin PRSS1 TRP1 TRY1_HUMAN Thrombin & trypsin Trypsin I | Trypsin-1
Type:
Enzyme
Mol. Mass.:
26557.80
Organism:
Homo sapiens (Human)
Description:
P07477
Residue:
247
  
Inhibitor
Name:
BDBM50124990
Synonyms:
CHEMBL355376 | N-[4-Guanidino-1-(thiazole-2-carbonyl)-butyl]-2-[2-oxo-4-(quinoline-8-sulfonyl)-piperazin-1-yl]-acetamide
Type:
Small organic molecule
Emp. Form.:
C24H28N8O5S2
Mol. Mass.:
572.66
SMILES:
NC(=N)NCCCC(NC(=O)CN1CCN(CC1=O)S(=O)(=O)c1cccc2cccnc12)C(=O)c1nccs1
: