Target
Prothrombin
Ligand
BDBM50125043
Substrate
Meas. Tech.
ChEBML_208864
IC50
2000±n/a nM
Citation
 Su, TYang, HVolkots, DWoolfrey, JDam, SWong, PSinha, UScarborough, RMZhu, BY Design, synthesis, and structure-activity relationships of substituted piperazinone-based transition state factor Xa inhibitors. Bioorg Med Chem Lett 13:729-32 (2003)  
Target
Name:
Prothrombin
Synonyms:
Activation peptide fragment 1 Coagulation factor II Prothrombin precursor Thrombin heavy chain | Thrombin light chain
Type:
Protein
Mol. Mass.:
70029.57
Organism:
Homo sapiens (Human)
Description:
P00734
Residue:
622
  
Inhibitor
Name:
BDBM50125043
Synonyms:
2-((S)-3-Benzyl-2-oxo-piperazin-1-yl)-N-[(S)-4-guanidino-1-(thiazole-2-carbonyl)-butyl]-acetamide | CHEMBL163412
Type:
Small organic molecule
Emp. Form.:
C22H29N7O3S
Mol. Mass.:
471.576
SMILES:
NC(=N)NCCC[C@H](NC(=O)CN1CCN[C@@H](Cc2ccccc2)C1=O)C(=O)c1nccs1
: