Target
Coagulation factor X
Ligand
BDBM50125033
Substrate
Meas. Tech.
ChEBML_69678
IC50
32±n/a nM
Citation
 Su, TYang, HVolkots, DWoolfrey, JDam, SWong, PSinha, UScarborough, RMZhu, BY Design, synthesis, and structure-activity relationships of substituted piperazinone-based transition state factor Xa inhibitors. Bioorg Med Chem Lett 13:729-32 (2003)  
Target
Name:
Coagulation factor X
Synonyms:
Activated coagulation factor X (FXa) Coagulation factor X precursor F10 Factor X heavy chain Factor Xa Stuart-Prower factor
Type:
Enzyme
Mol. Mass.:
54726.60
Organism:
Homo sapiens (Human)
Description:
Residue:
488
  
Inhibitor
Name:
BDBM50125033
Synonyms:
((S)-4-{[(S)-4-Guanidino-1-(thiazole-2-carbonyl)-butylcarbamoyl]-methyl}-3-oxo-1-phenylmethanesulfonyl-piperazin-2-yl)-acetic acid ethyl ester | CHEMBL162599
Type:
Small organic molecule
Emp. Form.:
C26H35N7O7S2
Mol. Mass.:
621.729
SMILES:
CCOC(=O)C[C@@H]1N(CCN(CC(=O)N[C@@H](CCCNC(N)=N)C(=O)c2nccs2)C1=O)S(=O)(=O)Cc1ccccc1
: