Target
Prothrombin
Ligand
BDBM50125034
Substrate
Meas. Tech.
ChEBML_208864
IC50
200000±n/a nM
Citation
 Su, TYang, HVolkots, DWoolfrey, JDam, SWong, PSinha, UScarborough, RMZhu, BY Design, synthesis, and structure-activity relationships of substituted piperazinone-based transition state factor Xa inhibitors. Bioorg Med Chem Lett 13:729-32 (2003)  
Target
Name:
Prothrombin
Synonyms:
Activation peptide fragment 1 Coagulation factor II Prothrombin precursor Thrombin heavy chain | Thrombin light chain
Type:
Protein
Mol. Mass.:
70029.57
Organism:
Homo sapiens (Human)
Description:
P00734
Residue:
622
  
Inhibitor
Name:
BDBM50125034
Synonyms:
2-[(R)-3-(3-Guanidino-propyl)-2,5-dioxo-piperazin-1-yl]-N-[(S)-4-guanidino-1-(thiazole-2-carbonyl)-butyl]-acetamide | CHEMBL162518
Type:
Small organic molecule
Emp. Form.:
C19H30N10O4S
Mol. Mass.:
494.571
SMILES:
NC(=N)NCCC[C@H](NC(=O)CN1CC(=O)N[C@H](CCCNC(N)=N)C1=O)C(=O)c1nccs1
: