Target
cAMP-specific 3',5'-cyclic phosphodiesterase 4A
Ligand
BDBM50125066
Substrate
Meas. Tech.
ChEBML_155034
IC50
0.300000±n/a nM
Citation
 Côté, BFrenette, RPrescott, SBlouin, MBrideau, CDucharme, YFriesen, RWLaliberté, FMasson, PStyhler, AGirard, Y Substituted aminopyridines as potent and selective phosphodiesterase-4 inhibitors. Bioorg Med Chem Lett 13:741-4 (2003)  
Target
Name:
cAMP-specific 3',5'-cyclic phosphodiesterase 4A
Synonyms:
3',5'-cyclic phosphodiesterase PDE46 PDE4A_HUMAN Phosphodiesterase 4A | Phosphodiesterase 4A (PDE4)
Type:
Enzyme
Mol. Mass.:
98113.27
Organism:
Homo sapiens (Human)
Description:
P27815
Residue:
886
  
Inhibitor
Name:
BDBM50125066
Synonyms:
CHEMBL165889 | {5-[1-(3,4-Bis-difluoromethoxy-phenyl)-2-(1-oxy-pyridin-4-yl)-ethyl]-pyridin-2-yl}-methyl-((R)-1-phenyl-ethyl)-amine
Type:
Small organic molecule
Emp. Form.:
C29H27F4N3O3
Mol. Mass.:
541.5366
SMILES:
C[C@@H](N(C)c1ccc(cn1)C(Cc1cc[n+]([O-])cc1)c1ccc(OC(F)F)c(OC(F)F)c1)c1ccccc1
: