Target
Forkhead box protein M1
Ligand
BDBM50085045
Substrate
Meas. Tech.
ChEMBL_2077765 (CHEMBL4733556)
Ki
52±n/a nM
Citation
 Tabatabaei Dakhili, SAPérez, DJGopal, KHaque, MUssher, JRKashfi, KVelázquez-Martínez, CA SP1-independent inhibition of FOXM1 by modified thiazolidinediones. Eur J Med Chem 209:0 (2021)  
Target
Name:
Forkhead box protein M1
Synonyms:
FKHL16 FOXM1_HUMAN Forkhead-related protein FKHL16 HFH11 Hepatocyte nuclear factor 3 forkhead homolog 11 MPM-2 reactive phosphoprotein 2 Transcription factor Trident Winged-helix factor from INS-1 cells
Type:
PROTEIN
Mol. Mass.:
84290.86
Organism:
Homo sapiens
Description:
ChEMBL_120188
Residue:
763
  
Inhibitor
Name:
BDBM50085045
Synonyms:
5-((4-((6-hydroxy-2,5,7,8-tetramethyl-3,4-dihydro-2H-chromen-2-yl)methoxy)phenyl)methyl)thiazolidine-2,4-dione 5-[4-(6-Hydroxy-2,5,7,8-tetramethyl-chroman-2-ylmethoxy)-benzy l]-thiazolidine-2,4-dione (troglitazone) 5-[4-(6-Hydroxy-2,5,7,8-tetramethyl-chroman-2-ylmethoxy)-benzyl]-thiazolidine-2,4-dione(troglitazone) CHEMBL408 CS-045 PRELAY TROGLITAZONE
Type:
Small organic molecule
Emp. Form.:
C24H27NO5S
Mol. Mass.:
441.54
SMILES:
Cc1c(C)c2OC(C)(COc3ccc(Cc4sc(=O)[nH]c4O)cc3)CCc2c(C)c1O
: