Target
Inosine-5'-monophosphate dehydrogenase 2
Ligand
BDBM50126006
Substrate
Meas. Tech.
ChEBML_234
IC50
64±n/a nM
Citation
 Watterson, SHDhar, TGBallentine, SKShen, ZBarrish, JCCheney, DFleener, CARouleau, KATownsend, RHollenbaugh, DLIwanowicz, EJ Novel indole-based inhibitors of IMPDH: introduction of hydrogen bond acceptors at indole C-3. Bioorg Med Chem Lett 13:1273-6 (2003)  
Target
Name:
Inosine-5'-monophosphate dehydrogenase 2
Synonyms:
IMDH2_HUMAN IMPD 2 IMPDH-II Inosine 5'-monophosphate dehydrogenase II (IMPDH II) Inosine-5 -monophosphate dehydrogenase 2 | Inosine-5'-monophosphate dehydrogenase (IMPDH)
Type:
Enzyme
Mol. Mass.:
55806.87
Organism:
Homo sapiens (Human)
Description:
Recombinant IMPDH2 expressed in E. coli.
Residue:
514
  
Inhibitor
Name:
BDBM50126006
Synonyms:
2-Benzo[b]thiophen-3-yl-6-methoxy-5-oxazol-5-yl-1H-indole-3-carbonitrile | CHEMBL283096
Type:
Small organic molecule
Emp. Form.:
C21H13N3O2S
Mol. Mass.:
371.412
SMILES:
COc1cc2[nH]c(-c3csc4ccccc34)c(C#N)c2cc1-c1cnco1
: