Target
Inosine-5'-monophosphate dehydrogenase 2
Ligand
BDBM50126288
Substrate
Meas. Tech.
ChEBML_235
IC50
1660±n/a nM
Citation
 Chen, PNorris, DHaslow, KDMurali Dhar, TGPitts, WJWatterson, SHCheney, DLBassolino, DAFleener, CARouleau, KAHollenbaugh, DLTownsend, RMBarrish, JCIwanowicz, EJ Identification of novel and potent isoquinoline aminooxazole-based IMPDH inhibitors. Bioorg Med Chem Lett 13:1345-8 (2003)  
Target
Name:
Inosine-5'-monophosphate dehydrogenase 2
Synonyms:
IMDH2_HUMAN IMPD 2 IMPDH-II Inosine 5'-monophosphate dehydrogenase II (IMPDH II) Inosine-5 -monophosphate dehydrogenase 2 | Inosine-5'-monophosphate dehydrogenase (IMPDH)
Type:
Enzyme
Mol. Mass.:
55806.87
Organism:
Homo sapiens (Human)
Description:
Recombinant IMPDH2 expressed in E. coli.
Residue:
514
  
Inhibitor
Name:
BDBM50126288
Synonyms:
1-(5-Chloro-isoquinolin-6-yl)-3-phenyl-urea | CHEMBL26419
Type:
Small organic molecule
Emp. Form.:
C16H12ClN3O
Mol. Mass.:
297.739
SMILES:
Clc1c(NC(=O)Nc2ccccc2)ccc2cnccc12
: