Target
Prothrombin
Ligand
BDBM50126300
Substrate
Meas. Tech.
ChEBML_208518
Ki
0.260000±n/a nM
Citation
 Burgey, CSRobinson, KALyle, TANantermet, PGSelnick, HGIsaacs, RCLewis, SDLucas, BJKrueger, JASingh, RMiller-Stein, CWhite, RBWong, BLyle, EAStranieri, MTCook, JJMcMasters, DRPellicore, JMPal, SWallace, AAClayton, FCBohn, DWelsh, DCLynch, JJYan, YChen, ZKuo, LGardell, SJShafer, JAVacca, JP Pharmacokinetic optimization of 3-amino-6-chloropyrazinone acetamide thrombin inhibitors. Implementation of P3 pyridine N-oxides to deliver an orally bioavailable series containing P1 N-benzylamides. Bioorg Med Chem Lett 13:1353-7 (2003)  
Target
Name:
Prothrombin
Synonyms:
Activation peptide fragment 1 Coagulation factor II Prothrombin precursor Thrombin heavy chain | Thrombin light chain
Type:
Protein
Mol. Mass.:
70029.57
Organism:
Homo sapiens (Human)
Description:
P00734
Residue:
622
  
Inhibitor
Name:
BDBM50126300
Synonyms:
CHEMBL25845 | N-(3-Chloro-benzyl)-2-{6-chloro-3-[2,2-difluoro-2-(1-oxy-pyridin-2-yl)-ethylamino]-2-oxo-2H-pyrazin-1-yl}-acetamide
Type:
Small organic molecule
Emp. Form.:
C20H17Cl2F2N5O3
Mol. Mass.:
484.283
SMILES:
[O-][n+]1ccccc1C(F)(F)CNc1ncc(Cl)n(CC(=O)NCc2cccc(Cl)c2)c1=O
: