Target
Tyrosine-protein kinase Lck
Ligand
BDBM50126731
Substrate
Meas. Tech.
ChEMBL_221314 (CHEMBL841204)
IC50
86.0±n/a nM
Citation
 Goldberg, DRButz, TCardozo, MGEckner, RJHammach, AHuang, JJakes, SKapadia, SKashem, MLukas, SMorwick, TMPanzenbeck, MPatel, UPav, SPeet, GWPeterson, JDProkopowicz, ASSnow, RJSellati, RTakahashi, HTan, JTschantz, MAWang, XJWang, YWolak, JXiong, PMoss, N Optimization of 2-phenylaminoimidazo[4,5-h]isoquinolin-9-ones: orally active inhibitors of lck kinase. J Med Chem 46:1337-49 (2003)  
Target
Name:
Tyrosine-protein kinase Lck
Synonyms:
2.7.10.2 LCK_HUMAN Leukocyte C-terminal Src kinase Lymphocyte-specific protein tyrosine kinase Protein YT16 Proto-oncogene tyrosine-protein kinase LCK T cell-specific protein-tyrosine kinase
Type:
Mol. Mass.:
57987.83
Organism:
Homo sapiens (Human)
Description:
P06239
Residue:
509
  
Inhibitor
Name:
BDBM50126731
Synonyms:
3-[2-(2,6-Dichloro-phenylamino)-1,6-dimethyl-9-oxo-8,9-dihydro-1H-imidazo[4,5-h]isoquinolin-7-yl]-acrylic acid methyl ester | CHEMBL26016
Type:
Small organic molecule
Emp. Form.:
C22H18Cl2N4O3
Mol. Mass.:
457.309
SMILES:
COC(=O)C=Cc1[nH]c(=O)c2c3n(C)c(Nc4c(Cl)cccc4Cl)nc3ccc2c1C
: