Target
Acetylcholinesterase
Ligand
BDBM50035852
Substrate
Meas. Tech.
ChEMBL_2082795 (CHEMBL4738586)
IC50
636000±n/a nM
Citation
 Wei, ZYang, JLiu, YNie, HYao, LYang, JGuo, LZheng, ZOuyang, Q Molecular modeling-guided optimization of acetylcholinesterase reactivators: A proof for reactivation of covalently inhibited targets. Eur J Med Chem 215:0 (2021)  
Target
Name:
Acetylcholinesterase
Synonyms:
ACES_HUMAN Acetylcholinesterase (AChE) | Acetylcholinesterase (human AChE)
Type:
Enzyme
Mol. Mass.:
67792.70
Organism:
Homo sapiens (Human)
Description:
P22303
Residue:
614
  
Inhibitor
Name:
BDBM50035852
Synonyms:
HI-6
Type:
Small organic molecule
Emp. Form.:
C14H16N4O3
Mol. Mass.:
288.3007
SMILES:
NC(=O)c1cc[n+](COC[n+]2ccccc2\C=N\O)cc1
: