Target
Plasminogen activator inhibitor 1
Ligand
BDBM50127732
Substrate
Meas. Tech.
ChEBML_155613
IC50
140±n/a nM
Citation
 De Nanteuil, GLila-Ambroise, CRupin, AVallez, MOVerbeuren, TJ New fibrinolytic agents: benzothiophene derivatives as inhibitors of the t-PA-PAI-1 complex formation. Bioorg Med Chem Lett 13:1705-8 (2003)  
Target
Name:
Plasminogen activator inhibitor 1
Synonyms:
Endothelial plasminogen activator inhibitor PAI-1 PAI1_HUMAN Plasminogen activator inhibitor 1 Plasminogen activator inhibitor-1 SERPINE1
Type:
Enzyme
Mol. Mass.:
45064.00
Organism:
Homo sapiens (Human)
Description:
P05121
Residue:
402
  
Inhibitor
Name:
BDBM50127732
Synonyms:
(E)-3-[3-(4-Chloro-phenoxy)-5,6-bis-(4'-methoxy-biphenyl-4-ylmethoxy)-benzo[b]thiophen-2-yl]-2-pyridin-4-yl-acrylic acid | CHEMBL295222
Type:
Small organic molecule
Emp. Form.:
C50H38ClNO7S
Mol. Mass.:
832.357
SMILES:
COc1ccc(cc1)-c1ccc(COc2cc3sc(\C=C(\C(O)=O)c4ccncc4)c(Oc4ccc(Cl)cc4)c3cc2OCc2ccc(cc2)-c2ccc(OC)cc2)cc1
: