Target
Estrogen receptor
Ligand
BDBM50128402
Substrate
Meas. Tech.
ChEBML_67514
Ki
0.900000±n/a nM
Citation
 Wallace, OBLauwers, KSJones, SADodge, JA Tetrahydroquinoline-based selective estrogen receptor modulators (SERMs). Bioorg Med Chem Lett 13:1907-10 (2003)  
Target
Name:
Estrogen receptor
Synonyms:
ER ESR ESR1_HUMAN Estrogen receptor Estrogen receptor (ER-alpha) Estrogen receptor alpha (ER) Nuclear receptor subfamily 3 group A member 1
Type:
Protein
Mol. Mass.:
66230.44
Organism:
Homo sapiens (Human)
Description:
P03372
Residue:
595
  
Inhibitor
Name:
BDBM50128402
Synonyms:
2-(4-Hydroxy-phenyl)-1-[4-(2-pyrrolidin-1-yl-ethoxy)-phenyl]-1,2,3,4-tetrahydro-quinolin-6-ol | CHEMBL56390
Type:
Small organic molecule
Emp. Form.:
C27H30N2O3
Mol. Mass.:
430.5387
SMILES:
Oc1ccc(cc1)C1CCc2cc(O)ccc2N1c1ccc(OCCN2CCCC2)cc1
: