Target
Ecdysone receptor
Ligand
BDBM50128492
Substrate
Meas. Tech.
ChEBML_65453
EC50
2150±n/a nM
Citation
 Smith, HCCavanaugh, CKFriz, JLThompson, CSSaggers, JAMichelotti, ELGarcia, JTice, CM Synthesis and SAR of cis-1-benzoyl-1,2,3,4-tetrahydroquinoline ligands for control of gene expression in ecdysone responsive systems. Bioorg Med Chem Lett 13:1943-6 (2003)  
Target
Name:
Ecdysone receptor
Synonyms:
20-hydroxy-ecdysone receptor AaEcR EcR Ecdysteroid receptor Nuclear receptor subfamily 1 group H member 1
Type:
PROTEIN
Mol. Mass.:
83656.95
Organism:
Aedes aegypti
Description:
ChEMBL_65453
Residue:
776
  
Inhibitor
Name:
BDBM50128492
Synonyms:
(4-Chloro-phenyl)-((2R,4S)-2,6-dimethyl-4-p-tolylamino-3,4-dihydro-2H-quinolin-1-yl)-methanone | CHEMBL291315
Type:
Small organic molecule
Emp. Form.:
C25H25ClN2O
Mol. Mass.:
404.932
SMILES:
C[C@@H]1C[C@H](Nc2ccc(C)cc2)c2cc(C)ccc2N1C(=O)c1ccc(Cl)cc1
: