Target
Acetylcholinesterase
Ligand
BDBM25870
Substrate
Meas. Tech.
ChEMBL_2088471 (CHEMBL4769734)
IC50
73300±n/a nM
Citation
 Rodríguez-Lavado, JGallardo-Garrido, CMallea, MBustos, VOsorio, RHödar-Salazar, MChung, HAraya-Maturana, RLorca, MPessoa-Mahana, CDMella-Raipán, JSaitz, CJaque, PReyes-Parada, MIturriaga-Vásquez, PPessoa-Mahana, H Synthesis, in vitro evaluation and molecular docking of a new class of indolylpropyl benzamidopiperazines as dual AChE and SERT ligands for Alzheimer's disease. Eur J Med Chem 198:0 (2020)  
Target
Name:
Acetylcholinesterase
Synonyms:
ACES_HUMAN Acetylcholinesterase (AChE) | Acetylcholinesterase (human AChE)
Type:
Enzyme
Mol. Mass.:
67792.70
Organism:
Homo sapiens (Human)
Description:
P22303
Residue:
614
  
Inhibitor
Name:
BDBM25870
Synonyms:
1-[3-(dimethylamino)propyl]-1-(4-fluorophenyl)-1,3-dihydro-2-benzofuran-5-carbonitrile CITALOPRAM Escitalopram [3H]Cytalopram [3H]Lexapro
Type:
radiolabeled ligand
Emp. Form.:
C20H21FN2O
Mol. Mass.:
324.3919
SMILES:
CN(C)CCCC1(OCc2cc(ccc12)C#N)c1ccc(F)cc1
: