Target
Inosine-5'-monophosphate dehydrogenase 2
Ligand
BDBM50116124
Substrate
Meas. Tech.
ChEBML_89803
IC50
76±n/a nM
Citation
 Iwanowicz, EJWatterson, SHGuo, JPitts, WJMurali Dhar, TGShen, ZChen, PGu, HHFleener, CARouleau, KACheney, DLTownsend, RMHollenbaugh, DL Inhibitors of inosine monophosphate dehydrogenase: SARs about the N-[3-Methoxy-4-(5-oxazolyl)phenyl moiety. Bioorg Med Chem Lett 13:2059-63 (2003)  
Target
Name:
Inosine-5'-monophosphate dehydrogenase 2
Synonyms:
IMDH2_HUMAN IMPD 2 IMPDH-II Inosine 5'-monophosphate dehydrogenase II (IMPDH II) Inosine-5 -monophosphate dehydrogenase 2 | Inosine-5'-monophosphate dehydrogenase (IMPDH)
Type:
Enzyme
Mol. Mass.:
55806.87
Organism:
Homo sapiens (Human)
Description:
Recombinant IMPDH2 expressed in E. coli.
Residue:
514
  
Inhibitor
Name:
BDBM50116124
Synonyms:
CHEMBL433062 | N-(3-Methoxy-4-oxazol-5-yl-phenyl)-N'-methyl-6-phenyl-[1,3,5]triazine-2,4-diamine
Type:
Small organic molecule
Emp. Form.:
C20H18N6O2
Mol. Mass.:
374.3959
SMILES:
CNc1nc(Nc2ccc(-c3cnco3)c(OC)c2)nc(n1)-c1ccccc1
: