Target
M-phase inducer phosphatase 3
Ligand
BDBM50129579
Substrate
Meas. Tech.
ChEMBL_49190 (CHEMBL662118)
IC50
3500±n/a nM
Citation
 Sohn, JKiburz, BLi, ZDeng, LSafi, APirrung, MCRudolph, J Inhibition of Cdc25 phosphatases by indolyldihydroxyquinones. J Med Chem 46:2580-8 (2003)  
Target
Name:
M-phase inducer phosphatase 3
Synonyms:
CDC25C M-phase inducer phosphatase 3 | MPIP3_HUMAN
Type:
Substrate
Mol. Mass.:
53366.11
Organism:
Homo sapiens (Human)
Description:
P30307
Residue:
473
  
Inhibitor
Name:
BDBM50129579
Synonyms:
2,5-Dihydroxy-3-[7-(2-methyl-benzyl)-1H-indol-3-yl]-[1,4]benzoquinone | CHEMBL87763
Type:
Small organic molecule
Emp. Form.:
C22H17NO4
Mol. Mass.:
359.3747
SMILES:
Cc1ccccc1Cc1cccc2c(c[nH]c12)C1C(=O)C(=O)CC(=O)C1=O
: