Target
Long-chain-fatty-acid--AMP ligase FadD28
Ligand
BDBM50565075
Substrate
Meas. Tech.
ChEMBL_2090005 (CHEMBL4771268)
Ki
710±n/a nM
Citation
 Baran, MGrimes, KDSibbald, PAFu, PBoshoff, HIMWilson, DJAldrich, CC Development of small-molecule inhibitors of fatty acyl-AMP and fatty acyl-CoA ligases in Mycobacterium tuberculosis. Eur J Med Chem 201:0 (2020)  
Target
Name:
Long-chain-fatty-acid--AMP ligase FadD28
Synonyms:
6.2.1.49 FAA28_MYCTU Long-chain fatty acid adenylyltransferase FadD28 acoas fadD28
Type:
PROTEIN
Mol. Mass.:
62629.92
Organism:
Mycobacterium tuberculosis (strain ATCC 25618 / H37Rv)
Description:
ChEMBL_101545
Residue:
580
  
Inhibitor
Name:
BDBM50565075
Synonyms:
CHEMBL4784453
Type:
Small organic molecule
Emp. Form.:
C27H38N6O8S
Mol. Mass.:
606.691
SMILES:
Nc1ncnc2n(cnc12)[C@@H]1O[C@H](COS(=O)(=O)NC(=O)CCCCCCCCCCOc2ccccc2)[C@@H](O)[C@H]1O
: