Target
Retinoic acid receptor RXR-alpha
Ligand
BDBM50129722
Substrate
Meas. Tech.
ChEMBL_196768 (CHEMBL798929)
Ki
2±n/a nM
Citation
 Michellys, PYArdecky, RJChen, JHCrombie, DLEtgen, GJFaul, MMFaulkner, ALGrese, TAHeyman, RAKaranewsky, DSKlausing, KLeibowitz, MDLiu, SMais, DAMapes, CMMarschke, KBReifel-Miller, AOgilvie, KMRungta, DThompson, AWTyhonas, JSBoehm, MF Novel (2E,4E,6Z)-7-(2-alkoxy-3,5-dialkylbenzene)-3-methylocta-2,4,6-trienoic acid retinoid X receptor modulators are active in models of type 2 diabetes. J Med Chem 46:2683-96 (2003)  
Target
Name:
Retinoic acid receptor RXR-alpha
Synonyms:
NR2B1 Nuclear receptor subfamily 4 group A member 2 RXRA Retinoic acid receptor RXR-alpha/gamma Retinoid receptor
Type:
PROTEIN
Mol. Mass.:
50820.38
Organism:
Homo sapiens (Human)
Description:
ChEMBL_1456363
Residue:
462
  
Inhibitor
Name:
BDBM50129722
Synonyms:
7-[3,5-Bis-(1,1-dimethyl-propyl)-2-ethoxy-phenyl]-3-methyl-octa-2,4,6-trienoic acid | CHEMBL315986
Type:
Small organic molecule
Emp. Form.:
C27H40O3
Mol. Mass.:
412.6047
SMILES:
CCOc1c(cc(cc1C(C)(C)CC)C(C)(C)CC)C(\C)=C/C=C/C(/C)=C/C(O)=O
: