Target
Amyloid-beta precursor protein
Ligand
BDBM50129784
Substrate
Meas. Tech.
ChEMBL_35793 (CHEMBL649400)
Ki
1.9±n/a nM
Citation
 Mathis, CAWang, YHolt, DPHuang, GFDebnath, MLKlunk, WE Synthesis and evaluation of 11C-labeled 6-substituted 2-arylbenzothiazoles as amyloid imaging agents. J Med Chem 46:2740-54 (2003)  
Target
Name:
Amyloid-beta precursor protein
Synonyms:
A4 ABPP AICD-50 AICD-59 AID(57) APP Alzheimer disease amyloid protein Amyloid beta Protein Amyloid beta protein Abeta(1-42) Amyloid intracellular domain 57 Amyloid protein (Abeta42b) Beta amyloid A4 protein Beta-APP42 Beta-amyloid protein 42 C83 CVAP Gamma Secretase Gamma-CTF(57) Gamma-secretase Gamma-secretase C-terminal fragment 57 P3(40) PN-II Protease nexin-II S-APP-beta Soluble APP-beta | beta-Amyloid Precursor Protein (APP)
Type:
Single-pass type I membrane protein
Mol. Mass.:
86890.41
Organism:
Homo sapiens (Human)
Description:
P05067
Residue:
770
  
Inhibitor
Name:
BDBM50129784
Synonyms:
4-(6-Methoxybenzo[d]thiazol-2-yl)-N,N-dimethylaniline [4-(6-Methoxy-benzothiazol-2-yl)-phenyl]-dimethyl-amine
Type:
Small organic molecule
Emp. Form.:
C16H16N2OS
Mol. Mass.:
284.376
SMILES:
COc1ccc2nc(sc2c1)-c1ccc(cc1)N(C)C
: