Target
5-hydroxytryptamine receptor 2A
Ligand
BDBM50130083
Substrate
Meas. Tech.
ChEBML_2293
Ki
29±n/a nM
Citation
 Ennis, MDHoffman, RLGhazal, NBOlson, RMKnauer, CSChio, CLHyslop, DKCampbell, JEFitzgerald, LWNichols, NFSvensson, KAMcCall, RBHaber, CLKagey, MLDinh, DM 2,3,4,5-tetrahydro- and 2,3,4,5,11,11a-hexahydro-1H-[1,4]diazepino[1,7-a]indoles: new templates for 5-HT(2C) agonists. Bioorg Med Chem Lett 13:2369-72 (2003)  
Target
Name:
5-hydroxytryptamine receptor 2A
Synonyms:
5-HT-2 5-HT2A 5-hydroxytryptamine receptor 2A (5HT-2A) 5HT2A_HUMAN HTR2A | Serotonin receptor 2A
Type:
undefined
Mol. Mass.:
52607.65
Organism:
Homo sapiens (Human)
Description:
P28223
Residue:
471
  
Inhibitor
Name:
BDBM50130083
Synonyms:
2,3,4,5-Tetrahydro-1H-[1,4]diazepino[1,7-a]indole-11-carbaldehyde | CHEMBL310473
Type:
Small organic molecule
Emp. Form.:
C13H14N2O
Mol. Mass.:
214.2631
SMILES:
O=Cc1c2CCNCCn2c2ccccc12
: