Target
Thyroid hormone receptor alpha
Ligand
BDBM50130597
Substrate
Meas. Tech.
ChEMBL_210492 (CHEMBL814599)
Kd
2.02±n/a nM
Citation
 Yoshihara, HAApriletti, JWBaxter, JDScanlan, TS Structural determinants of selective thyromimetics. J Med Chem 46:3152-61 (2003)  
Target
Name:
Thyroid hormone receptor alpha
Synonyms:
C-erbA-alpha EAR7 NR1A1 THA_HUMAN THRA1 Thyroid Hormone Receptor (TR-alpha) Thyroid hormone receptor alpha c-erbA-1
Type:
Receptor
Mol. Mass.:
54818.00
Organism:
Homo sapiens (Human)
Description:
Recombinant hThR was obtained from nuclear extracts from SF9 cells infected with baculovirus vectors encoding for ThRalpha 1.
Residue:
490
  
Inhibitor
Name:
BDBM50130597
Synonyms:
2-Amino-3-[4-(4-hydroxy-3-isopropyl-benzyl)-3,5-dimethyl-phenyl]-propionic acid | CHEMBL110335
Type:
Small organic molecule
Emp. Form.:
C21H27NO3
Mol. Mass.:
341.444
SMILES:
CC(C)c1cc(Cc2c(C)cc(C[C@H](N)C(O)=O)cc2C)ccc1O
: