Target
Cannabinoid receptor 2
Ligand
BDBM50130624
Substrate
Meas. Tech.
ChEMBL_40028 (CHEMBL653009)
Ki
0.22±n/a nM
Citation
 Papahatjis, DPNikas, SPKourouli, TChari, RXu, WPertwee, RGMakriyannis, A Pharmacophoric requirements for the cannabinoid side chain. Probing the cannabinoid receptor subsite at C1'. J Med Chem 46:3221-9 (2003)  
Target
Name:
Cannabinoid receptor 2
Synonyms:
CANNABINOID CB2 CB2 Cannabinoid CB2 receptor Cannabinoid receptor 2 mCB2
Type:
Enzyme Catalytic Domain
Mol. Mass.:
38220.43
Organism:
MOUSE
Description:
P47936
Residue:
347
  
Inhibitor
Name:
BDBM50130624
Synonyms:
(6aR,10aR)-3-(2-hexyl-1,3-dioxolan-2-yl)-6,6,9-trimethyl-6a,7,10,10a-tetrahydro-6H-benzo[c]chromen-1-ol CHEMBL108085
Type:
Small organic molecule
Emp. Form.:
C25H36O4
Mol. Mass.:
400.5509
SMILES:
CCCCCCC1(OCCO1)c1cc(O)c2[C@@H]3CC(C)=CC[C@H]3C(C)(C)Oc2c1
: