Target
M-phase inducer phosphatase 3
Ligand
BDBM50131547
Substrate
Meas. Tech.
ChEMBL_49198 (CHEMBL662919)
Ki
>3000±n/a nM
Citation
 Liu, GXin, ZLiang, HAbad-Zapatero, CHajduk, PJJanowick, DASzczepankiewicz, BGPei, ZHutchins, CWBallaron, SJStashko, MALubben, THBerg, CERondinone, CMTrevillyan, JMJirousek, MR Selective protein tyrosine phosphatase 1B inhibitors: targeting the second phosphotyrosine binding site with non-carboxylic acid-containing ligands. J Med Chem 46:3437-40 (2003)  
Target
Name:
M-phase inducer phosphatase 3
Synonyms:
CDC25C M-phase inducer phosphatase 3 | MPIP3_HUMAN
Type:
Substrate
Mol. Mass.:
53366.11
Organism:
Homo sapiens (Human)
Description:
P30307
Residue:
473
  
Inhibitor
Name:
BDBM50131547
Synonyms:
2-(N-(4-(2-acetamido-3-(4-(5-chloro-3-hydroxy-2-(methoxycarbonyl)phenoxy)butylamino)-3-oxopropyl)-2-ethylphenyl)-1-carboxyformamido)benzoic acid CHEMBL117496
Type:
Small organic molecule
Emp. Form.:
C34H36ClN3O11
Mol. Mass.:
698.116
SMILES:
CCc1cc(CC(NC(C)=O)C(=O)NCCCCOc2cc(Cl)cc(O)c2C(=O)OC)ccc1N(C(=O)C(O)=O)c1ccccc1C(O)=O
: