Target
Estrogen receptor
Ligand
BDBM50131557
Substrate
Meas. Tech.
ChEMBL_42210 (CHEMBL658311)
EC50
1200±n/a nM
Citation
 Mestres, JVeeneman, GH Identification of"latent hits" in compound screening collections. J Med Chem 46:3441-4 (2003)  
Target
Name:
Estrogen receptor
Synonyms:
ER ESR ESR1_HUMAN Estrogen receptor Estrogen receptor (ER-alpha) Estrogen receptor alpha (ER) Nuclear receptor subfamily 3 group A member 1
Type:
Protein
Mol. Mass.:
66230.44
Organism:
Homo sapiens (Human)
Description:
P03372
Residue:
595
  
Inhibitor
Name:
BDBM50131557
Synonyms:
CHEMBL116918 | [1,1';4',1'']Terphenyl-4,4''-diol
Type:
Small organic molecule
Emp. Form.:
C18H14O2
Mol. Mass.:
262.3026
SMILES:
Oc1ccc(cc1)-c1ccc(cc1)-c1ccc(O)cc1
: