Target
Alkaline phosphatase, germ cell type
Ligand
BDBM50131861
Substrate
Meas. Tech.
ChEMBL_157081 (CHEMBL765525)
Ki
200000±n/a nM
Citation
 Swierczek, KPandey, ASPeters, JWHengge, AC A comparison of phosphonothioic acids with phosphonic acids as phosphatase inhibitors. J Med Chem 46:3703-8 (2003)  
Target
Name:
Alkaline phosphatase, germ cell type
Synonyms:
ALPG ALPPL2 PPBN_HUMAN | placental-like alkaline phosphatase preproprotein
Type:
PROTEIN
Mol. Mass.:
57374.31
Organism:
Homo sapiens (Human)
Description:
ChEMBL_29964
Residue:
532
  
Inhibitor
Name:
BDBM50131861
Synonyms:
Benzyl-phosphonothioic acid | CHEMBL123163
Type:
Small organic molecule
Emp. Form.:
C7H9O2PS
Mol. Mass.:
188.184
SMILES:
OP(O)(=S)Cc1ccccc1
: