Target
D(3) dopamine receptor
Ligand
BDBM50132025
Substrate
Meas. Tech.
ChEMBL_62137 (CHEMBL675894)
Ki
1.8±n/a nM
Citation
 Hackling, AGhosh, RPerachon, SMann, AHöltje, HDWermuth, CGSchwartz, JCSippl, WSokoloff, PStark, H N-(omega-(4-(2-methoxyphenyl)piperazin-1-yl)alkyl)carboxamides as dopamine D2 and D3 receptor ligands. J Med Chem 46:3883-99 (2003)  
Target
Name:
D(3) dopamine receptor
Synonyms:
DOPAMINE D3 DRD3_HUMAN Dopamine D3 receptor (D3) Dopamine receptor Dopamine receptor D3
Type:
Mol. Mass.:
44243.43
Organism:
Homo sapiens (Human)
Description:
Residue:
400
  
Inhibitor
Name:
BDBM50132025
Synonyms:
2-Oxo-2H-chromene-3-carboxylic acid {4-[4-(2-methoxy-phenyl)-piperazin-1-yl]-butyl}-amide N-[4-[4-(2-methoxyphenyl)piperazin-1-yl]butyl]-2-oxo-2H-1-benzopyran-3-carboxamide
Type:
Small organic molecule
Emp. Form.:
C25H29N3O4
Mol. Mass.:
435.5155
SMILES:
COc1ccccc1N1CCN(CCCCNC(=O)c2cc3ccccc3oc2=O)CC1
: