Target
D(3) dopamine receptor
Ligand
BDBM50132055
Substrate
Meas. Tech.
ChEMBL_62137 (CHEMBL675894)
Ki
0.6±n/a nM
Citation
 Hackling, AGhosh, RPerachon, SMann, AHöltje, HDWermuth, CGSchwartz, JCSippl, WSokoloff, PStark, H N-(omega-(4-(2-methoxyphenyl)piperazin-1-yl)alkyl)carboxamides as dopamine D2 and D3 receptor ligands. J Med Chem 46:3883-99 (2003)  
Target
Name:
D(3) dopamine receptor
Synonyms:
DOPAMINE D3 DRD3_HUMAN Dopamine D3 receptor (D3) Dopamine receptor Dopamine receptor D3
Type:
Mol. Mass.:
44243.43
Organism:
Homo sapiens (Human)
Description:
Residue:
400
  
Inhibitor
Name:
BDBM50132055
Synonyms:
3-Furan-2-yl-N-{4-[4-(2-methoxy-phenyl)-piperazin-1-yl]-butyl}-acrylamide; oxalic acid | CHEMBL341299
Type:
Small organic molecule
Emp. Form.:
C22H29N3O3
Mol. Mass.:
383.484
SMILES:
COc1ccccc1N1CCN(CCCCNC(=O)\C=C\c2ccco2)CC1
: